BDBM105815 US8575197, I-325
SMILES COc1cc(F)ccc1C1C(C(=O)C(C)C)C(=O)C(=O)N1c1ccc(cc1)-c1ccsc1
InChI Key InChIKey=GIWSWILVYLQLQK-UHFFFAOYSA-N
Data  1 IC50
  Tab Delimited (TSV)   2D SDfile   Computed 3D by Vconf -m prep SDfile
Find this compound or compounds like it in BindingDB:
Activity Spreadsheet -- Enzyme Inhibition Constant Data from BindingDB
Found 1 hit for monomerid = 105815
TargetP2X purinoceptor 3(Homo sapiens (Human))
Shionogi
US Patent
LigandPNGBDBM105815(US8575197, I-325)
Affinity DataIC50:  18nM. Assay description: Inhibition assay using human P2X3 receptor gene (GeneBank accession number Y07683).
In DepthDetails US Patent