BDBM105957 US8575197, I-467
SMILES COc1ccccc1C1C(C(=O)C(=O)N1c1ccc(cc1)-c1ccc(C)o1)S(=O)(=O)C(C)C
InChI Key InChIKey=UPDRUYSWNGGBSI-UHFFFAOYSA-N
Data  1 IC50
  Tab Delimited (TSV)   2D SDfile   Computed 3D by Vconf -m prep SDfile
Find this compound or compounds like it in BindingDB:
Activity Spreadsheet -- Enzyme Inhibition Constant Data from BindingDB
Found 1 hit for monomerid = 105957
TargetP2X purinoceptor 3(Homo sapiens (Human))
Shionogi
US Patent
LigandPNGBDBM105957(US8575197, I-467)
Affinity DataIC50:  286nM. Assay description: Inhibition assay using human P2X3 receptor gene (GeneBank accession number Y07683).
In DepthDetails US Patent