BDBM106572 US8586617, 4
SMILES CN(Cc1cnc[nH]1)c1cccc(F)c1
InChI Key InChIKey=ZTGLLOHUTAHVAR-UHFFFAOYSA-N
Data  1 KI
  Tab Delimited (TSV)   2D SDfile   Computed 3D by Vconf -m prep SDfile
Find this compound or compounds like it in BindingDB:
Activity Spreadsheet -- Enzyme Inhibition Constant Data from BindingDB
Found 1 hit for monomerid = 106572
TargetTrace amine-associated receptor 1(Mus musculus (Mouse))
Hoffmann-La Roche
US Patent
LigandPNGBDBM106572(US8586617, 4)
Affinity DataKi:  2.90nM ΔG°:  -10.8kcal/moleT: 2°C. Assay description: Radioligand binding assay: The radioligand [3H]-rac-2-(1,2,3,4-tetrahydro-1-naphthyl)-2-imidazoline was used at a concentration equal to the calcula...
In DepthDetails US Patent