BDBM1071 2-[(5-ethyl-2-methoxy-6-methylpyridin-3-yl)methyl]-2,3-dihydro-1H-isoindole-1,3-dione::2-methoxypyridine deriv. 25
SMILES CCc1cc(CN2C(=O)c3ccccc3C2=O)c(OC)nc1C
InChI Key InChIKey=ZSCLJGSDZMBLNY-UHFFFAOYSA-N
Data  1 IC50
  Tab Delimited (TSV)   2D SDfile   Computed 3D by Vconf -m prep SDfile
Find this compound or compounds like it in BindingDB:
Activity Spreadsheet -- Enzyme Inhibition Constant Data from BindingDB
Found 1 hit for monomerid = 1071
TargetGag-Pol polyprotein [588-1027]/[588-1147](Human immunodeficiency virus type 1)
Merck Research Laboratories
LigandPNGBDBM1071(2-[(5-ethyl-2-methoxy-6-methylpyridin-3-yl)methyl]...)
Affinity DataIC50:  1.60E+4nMpH: 8.2Assay Description:The IC50 of reverse transcriptase is the concentration that inhibits 50% of recombinant HIV-1 RT RNA-directed DNA polymerase activity in vitro.
Ligand InfoPC cidPC sid
In DepthDetails ArticlePubMed