BDBM107245 US8598345, Table 1-31
SMILES FC(F)(F)c1csc(NC(=O)c2cc(Oc3cccnc3)ccn2)n1
InChI Key InChIKey=JFOKHDFNIICWIN-UHFFFAOYSA-N
Data  1 IC50
  Tab Delimited (TSV)   2D SDfile   Computed 3D by Vconf -m prep SDfile
Find this compound or compounds like it in BindingDB:
Activity Spreadsheet -- Enzyme Inhibition Constant Data from BindingDB
Found 1 hit for monomerid = 107245
TargetMetabotropic glutamate receptor 5(Rattus norvegicus (Rat))
Vanderbilt University
US Patent
LigandPNGBDBM107245(US8598345, Table 1-31)
Affinity DataIC50:  1.11E+3nM. Assay description: mGluR5 activity was determined in a cell-based assay.
In DepthDetails US Patent