BDBM107256 US8598345, Table 1-42
SMILES O=C(NC1CCOCC1)c1cc(Oc2cccnc2)ccn1
InChI Key InChIKey=HUIJXCUUBSRUPE-UHFFFAOYSA-N
Data  1 IC50
  Tab Delimited (TSV)   2D SDfile   Computed 3D by Vconf -m prep SDfile
Find this compound or compounds like it in BindingDB:
Activity Spreadsheet -- Enzyme Inhibition Constant Data from BindingDB
Found 1 hit for monomerid = 107256
TargetMetabotropic glutamate receptor 5(Rattus norvegicus (Rat))
Vanderbilt University
US Patent
LigandPNGBDBM107256(US8598345, Table 1-42)
Affinity DataIC50: >1.00E+4nM. Assay description: mGluR5 activity was determined in a cell-based assay.
In DepthDetails US Patent