BDBM10744 8-amino-5,6,7,8-tetrahydronaphthalen-2-yl N,N-dimethylcarbamate::tetrahydronaphthalene deriv. 16a
SMILES CN(C)C(=O)Oc1ccc2CCCC(N)c2c1
InChI Key InChIKey=KNFAZGBZIYULFY-UHFFFAOYSA-N
Data  1 IC50
  Tab Delimited (TSV)   2D SDfile   Computed 3D by Vconf -m prep SDfile
Find this compound or compounds like it in BindingDB:
Activity Spreadsheet -- Enzyme Inhibition Constant Data from BindingDB
Found 1 hit for monomerid = 10744
TargetAcetylcholinesterase(Homo sapiens (Human))
Teva Pharmaceutical Industries
LigandPNGBDBM10744(8-amino-5,6,7,8-tetrahydronaphthalen-2-yl N,N-dime...)
Affinity DataIC50:  1.48E+3nM. Assay description: The cholinesterase assays were performed using colorimetric method reported by Ellman. The absorbance changes at 412 nm were recorded for 5 min with ...
In DepthDetails ArticlePubMed