BDBM107725 US8933095, 9
SMILES N[C@H]1Cc2cn(Cc3ccc4ccccc4c3)nc2N(O)C1=O
InChI Key InChIKey=GKFXVWAEQLGWQM-HNNXBMFYSA-N
Data  2 IC50
  Tab Delimited (TSV)   2D SDfile   Computed 3D by Vconf -m prep SDfile
Find this compound or compounds like it in BindingDB:
Activity Spreadsheet -- Enzyme Inhibition Constant Data from BindingDB
Found 2 hits for monomerid = 107725
TargetKynurenine/alpha-aminoadipate aminotransferase, mitochondrial(Homo sapiens (Human))
Pfizer
US Patent
LigandPNGBDBM107725(US8933095, 9)
Affinity DataIC50:  117nMT: 2°C. Assay description: Formation of kynurenic acid (KYNA) is indirectly assessed by a decrease in light absorbance at 370 nm (OD370) as the L-kynurenine (KYN) substrate is ...
In DepthDetails US Patent
TargetKynurenine/alpha-aminoadipate aminotransferase, mitochondrial(Homo sapiens (Human))
Pfizer
US Patent
LigandPNGBDBM107725(US8933095, 9)
Affinity DataIC50:  117nM. Assay description: Formation of kynurenic acid (KYNA) is indirectly assessed by a decrease in light absorbance at 370 nm (OD370) as the L-kynurenine (KYN) substrate is ...
In DepthDetails US Patent