BDBM107976 US9695170 86
SMILES Oc1c(ncc2c1ccn(Cc1ccccc1)c2=O)C(=O)NCC1NNNN1
InChI Key InChIKey=AMOLMSKBTXSYHP-UHFFFAOYSA-N
Data  1 IC50
  Tab Delimited (TSV)   2D SDfile   Computed 3D by Vconf -m prep SDfile
Find this compound or compounds like it in BindingDB:
Activity Spreadsheet -- Enzyme Inhibition Constant Data from BindingDB
Found 1 hit for monomerid = 107976
TargetEgl nine homolog 1(Homo sapiens (Human))
Fibrogen
US Patent
LigandPNGBDBM107976(US9695170 86)
Affinity DataIC50:  290nMpH: 7.4Assay Description:Ketoglutaric acid α-[1-14C]-sodium salt, alpha-ketoglutaric acid sodium salt, and HPLC purified peptide may be obtained from commercial sources...
In DepthDetails US Patent