BDBM108189 US8598157, I-66
SMILES CCc1ncnc(N2CCC(O)CC2)c1C#Cc1cnc(C)c(NS(=O)(=O)c2ccc(F)cc2)c1
InChI Key InChIKey=DNLOHONLCIGVSK-UHFFFAOYSA-N
Data  1 IC50
  Tab Delimited (TSV)   2D SDfile   Computed 3D by Vconf -m prep SDfile
Find this compound or compounds like it in BindingDB:
Activity Spreadsheet -- Enzyme Inhibition Constant Data from BindingDB
Found 1 hit for monomerid = 108189
TargetPhosphatidylinositol 4,5-bisphosphate 3-kinase catalytic subunit alpha isoform(Homo sapiens (Human))
Boehringer Ingelheim International
US Patent
LigandPNGBDBM108189(US8598157, I-66)
Affinity DataIC50:  0.480nMT: 2°C. Assay description: This PI3Kalpha assay provides an IC50 value indicative of the activity of the compounds to inhibit PI3 kinase alpha activity. Inhibition of PI3 kinas...
In DepthDetails US Patent