BDBM108385 US9695170 108
SMILES CN(C(=O)CCNC(=O)c1ncc2n(Cc3ccccc3)c(=O)c(cc2c1O):c1ccccc1)S(C)(=O)=O
InChI Key InChIKey=QJQCNKLDDDAYQZ-UHFFFAOYSA-N
Data  1 IC50
  Tab Delimited (TSV)   2D SDfile   Computed 3D by Vconf -m prep SDfile
Find this compound or compounds like it in BindingDB:
Activity Spreadsheet -- Enzyme Inhibition Constant Data from BindingDB
Found 1 hit for monomerid = 108385
TargetEgl nine homolog 1(Homo sapiens (Human))
Fibrogen
US Patent
LigandPNGBDBM108385(US9695170 108)
Affinity DataIC50:  2.00E+5nMpH: 7.4Assay Description:Ketoglutaric acid α-[1-14C]-sodium salt, alpha-ketoglutaric acid sodium salt, and HPLC purified peptide may be obtained from commercial sources...
In DepthDetails US Patent