BDBM108819 US8604016, 399::US9938267, Cmpd ID 399
SMILES CC(C)(C)OC(=O)Nc1cccc(CC(=O)Nc2nnc(CCCCc3ccc(NC(=O)Cc4ccccc4)nn3)s2)c1
InChI Key InChIKey=BMTOTVRGXABICX-UHFFFAOYSA-N
Data  2 IC50
  Tab Delimited (TSV)   2D SDfile   Computed 3D by Vconf -m prep SDfile
Find this compound or compounds like it in BindingDB:
Activity Spreadsheet -- Enzyme Inhibition Constant Data from BindingDB
Found 2 hits for monomerid = 108819
TargetGlutaminase kidney isoform, mitochondrial(Homo sapiens (Human))
Calithera Biosciences
US Patent
LigandPNGBDBM108819(US8604016, 399 | US9938267, Cmpd ID 399)
Affinity DataIC50:  5nM. Assay description: Compounds were assessed for their ability to inhibit the enzymatic activity of a recombinant form of Glutaminase 1 (GAC) using a biochemical assay th...
In DepthDetails US Patent
TargetGlutaminase kidney isoform, mitochondrial(Homo sapiens (Human))
Calithera Biosciences
US Patent
LigandPNGBDBM108819(US8604016, 399 | US9938267, Cmpd ID 399)
Affinity DataIC50:  5nM. Assay description: Compounds were assessed for their ability to inhibit the enzymatic activity of a recombinant form of Glutaminase 1 (GAC) using a biochemical assay th...
In DepthDetails US Patent