BDBM109160 US8609852, 67
SMILES Cc1nc(cs1)C#Cc1cncc(CCc2ccccc2)c1
InChI Key InChIKey=QNEZAUBGBZPAQV-UHFFFAOYSA-N
Data  1 KI
  Tab Delimited (TSV)   2D SDfile   Computed 3D by Vconf -m prep SDfile
Find this compound or compounds like it in BindingDB:
Activity Spreadsheet -- Enzyme Inhibition Constant Data from BindingDB
Found 1 hit for monomerid = 109160
TargetMetabotropic glutamate receptor 5(Rattus norvegicus (Rat))
Merck Sharp & Dohme
US Patent
LigandPNGBDBM109160(US8609852, 67)
Affinity DataKi:  7nM ΔG°:  -11.1kcal/moleT: 2°C. Assay description: Binding assays were performed as described in Schaffhauser H, Richards J G, Cartmell J, Chaboz S, Kemp J A, Klingelschmidt A, Messer J, Stadler H, Wo...
In DepthDetails US Patent