BDBM109229 CB29 (derivative 19)
SMILES CC(C)NS(=O)(=O)c1ccc(NC2CCN(CC(=O)Nc3ccccc3)CC2)c(c1)[N+]([O-])=O
InChI Key InChIKey=HZIAVAFBOJTXSF-UHFFFAOYSA-N
Data  1 IC50
  Tab Delimited (TSV)   2D SDfile   Computed 3D by Vconf -m prep SDfile
Find this compound or compounds like it in BindingDB:
Activity Spreadsheet -- Enzyme Inhibition Constant Data from BindingDB
Found 1 hit for monomerid = 109229
TargetAldehyde dehydrogenase, dimeric NADP-preferring(Homo sapiens (Human))
Indiana University
LigandPNGBDBM109229(CB29 (derivative 19))
Affinity DataIC50:  2.56E+4nM. Assay description: To determine the IC50 values for CB29 and its analogues, propionaldehyde was used as the substrate for ALDH1A1 and ALDH2 and benzaldehyde was used as...
In DepthDetails ArticlePubMed