BDBM109243 US8609710, 7
SMILES NCCCC(Cc1cn(cn1)[C@H]1CC[C@H](O)CC1)C(O)=O
InChI Key InChIKey=CEXOYROFZTUKIF-RCWADLFESA-N
Data  1 IC50
  Tab Delimited (TSV)   2D SDfile   Computed 3D by Vconf -m prep SDfile
Find this compound or compounds like it in BindingDB:
Activity Spreadsheet -- Enzyme Inhibition Constant Data from BindingDB
Found 1 hit for monomerid = 109243
TargetCarboxypeptidase B2(Homo sapiens (Human))
Daiichi Sankyo
US Patent
LigandPNGBDBM109243(US8609710, 7)
Affinity DataIC50:  26nM. Assay description: Enzyme inhibition assay using TAFIa.
In DepthDetails US Patent