BDBM109244 US8609710, 8
SMILES CC1(O)CCC(CC1)n1cnc(CC(CCCN)C(O)=O)c1
InChI Key InChIKey=GESSUOCTJXXJDY-UHFFFAOYSA-N
Data  1 IC50
  Tab Delimited (TSV)   2D SDfile   Computed 3D by Vconf -m prep SDfile
Find this compound or compounds like it in BindingDB:
Activity Spreadsheet -- Enzyme Inhibition Constant Data from BindingDB
Found 1 hit for monomerid = 109244
TargetCarboxypeptidase B2(Homo sapiens (Human))
Daiichi Sankyo
US Patent
LigandPNGBDBM109244(US8609710, 8)
Affinity DataIC50:  19nM. Assay description: Enzyme inhibition assay using TAFIa.
In DepthDetails US Patent