BDBM109249 US8609710, 13
SMILES NCCCC(Cc1cn(cn1)C1C2CC3CC(C2)CC1C3)C(O)=O
InChI Key InChIKey=WSBZOSHMXZRDKY-UHFFFAOYSA-N
Data  1 IC50
  Tab Delimited (TSV)   2D SDfile   Computed 3D by Vconf -m prep SDfile
Find this compound or compounds like it in BindingDB:
Activity Spreadsheet -- Enzyme Inhibition Constant Data from BindingDB
Found 1 hit for monomerid = 109249
TargetCarboxypeptidase B2(Homo sapiens (Human))
Daiichi Sankyo
US Patent
LigandPNGBDBM109249(US8609710, 13)
Affinity DataIC50:  12nM. Assay description: Enzyme inhibition assay using TAFIa.
In DepthDetails US Patent