BDBM109252 US8609710, 15 (2S form)
SMILES C[C@H]1CC[C@@H](CC1)n1cnc(C[C@H](CCCN)C(O)=O)c1
InChI Key InChIKey=AEHFUSPLVGWEEP-YDHLFZDLSA-N
Data  1 IC50
  Tab Delimited (TSV)   2D SDfile   Computed 3D by Vconf -m prep SDfile
Find this compound or compounds like it in BindingDB:
Activity Spreadsheet -- Enzyme Inhibition Constant Data from BindingDB
Found 1 hit for monomerid = 109252
TargetCarboxypeptidase B2(Homo sapiens (Human))
Daiichi Sankyo
US Patent
LigandPNGBDBM109252(US8609710, 15 (2S form))
Affinity DataIC50:  7.80nM. Assay description: Enzyme inhibition assay using TAFIa.
In DepthDetails US Patent