BDBM10932 3-{[ethyl({3-[(9-oxo-9H-xanthen-3-yl)oxy]propyl})amino]methyl}phenyl N-methylcarbamate::aminoalkoxyheteroaryl deriv. 25
SMILES CCN(CCCOc1ccc2c(c1)oc1ccccc1c2=O)Cc1cccc(OC(=O)NC)c1
InChI Key InChIKey=HXQCOCVRUGEICR-UHFFFAOYSA-N
Data  4 IC50
  Tab Delimited (TSV)   2D SDfile   Computed 3D by Vconf -m prep SDfile
Find this compound or compounds like it in BindingDB:
Activity Spreadsheet -- Enzyme Inhibition Constant Data from BindingDB
Found 4 hits for monomerid = 10932
TargetAcetylcholinesterase(Homo sapiens (Human))
University Of Bologna
LigandPNGBDBM10932(3-{[ethyl({3-[(9-oxo-9H-xanthen-3-yl)oxy]propyl})a...)
Affinity DataIC50:  0.560nM. Assay description: The cholinesterase assays were performed using colorimetric method reported by Ellman. The absorbance changes at 412 nm were recorded for 5 min with ...
In DepthDetails ArticlePubMed
TargetAcetylcholinesterase(Homo sapiens (Human))
University Of Bologna
LigandPNGBDBM10932(3-{[ethyl({3-[(9-oxo-9H-xanthen-3-yl)oxy]propyl})a...)
Affinity DataIC50:  0.560nM. Assay description: Inhibition of acetylcholinesterase (unknown origin)
In DepthDetails Article
TargetAcetylcholinesterase(Homo sapiens (Human))
University Of Bologna
LigandPNGBDBM10932(3-{[ethyl({3-[(9-oxo-9H-xanthen-3-yl)oxy]propyl})a...)
Affinity DataIC50:  0.560nM. Assay description: Inhibition of AChE
In DepthDetails ArticlePubMed
TargetCholinesterase(Homo sapiens (Human))
University Of Bologna
LigandPNGBDBM10932(3-{[ethyl({3-[(9-oxo-9H-xanthen-3-yl)oxy]propyl})a...)
Affinity DataIC50:  21nM. Assay description: The cholinesterase assays were performed using colorimetric method reported by Ellman. The absorbance changes at 412 nm were recorded for 5 min with ...
In DepthDetails ArticlePubMed