BDBM109457 US8604061, 194
SMILES CCC(C[C@H]1COC(N)=N1)c1cccc(c1)C(F)(F)F
InChI Key InChIKey=FLXJXIDLYBOYHY-ACGXKRRESA-N
Data  1 KI
  Tab Delimited (TSV)   2D SDfile   Computed 3D by Vconf -m prep SDfile
Find this compound or compounds like it in BindingDB:
Activity Spreadsheet -- Enzyme Inhibition Constant Data from BindingDB
Found 1 hit for monomerid = 109457
TargetTrace amine-associated receptor 1(Mus musculus (Mouse))
Hoffmann-La Roche
US Patent
LigandPNGBDBM109457(US8604061, 194)
Affinity DataKi:  7.30nM. Assay description: Radioligand binding assay using TAAR1.
In DepthDetails US Patent