BDBM109537 US8604061, 311
SMILES CC1(COC(N)=N1)c1cccc(Cl)c1F
InChI Key InChIKey=RVGGAIBMRTWLOO-UHFFFAOYSA-N
Data  1 KI
  Tab Delimited (TSV)   2D SDfile   Computed 3D by Vconf -m prep SDfile
Find this compound or compounds like it in BindingDB:
Activity Spreadsheet -- Enzyme Inhibition Constant Data from BindingDB
Found 1 hit for monomerid = 109537
TargetTrace amine-associated receptor 1(Rattus norvegicus (Rat))
Hoffmann-La Roche
US Patent
LigandPNGBDBM109537(US8604061, 311)
Affinity DataKi:  4.20nM. Assay description: Radioligand binding assay using TAAR1.
In DepthDetails US Patent