BDBM10965 (1R,3aS,8aS)-1-hydroxy-1,3a,8-trimethyl-5-[(phenylcarbamoyl)oxy]-1H,2H,3H,3aH,8H,8aH-pyrrolo[2,3-b]indol-1-ium chloride::phenylgeneserine N-oxide::phenylgeneserine.HCl
SMILES [H][C@@]12N(C)c3ccc(OC(=O)Nc4ccccc4)cc3[C@]1(C)CC[N@@+]2(C)O
InChI Key InChIKey=CJVCVNDKLPBCBG-GREBRCKQSA-O
Data  2 IC50
  Tab Delimited (TSV)   2D SDfile   Computed 3D by Vconf -m prep SDfile
Find this compound or compounds like it in BindingDB:
Activity Spreadsheet -- Enzyme Inhibition Constant Data from BindingDB
Found 2 hits for monomerid = 10965
TargetCholinesterase(Homo sapiens (Human))
National Institutes Of Health
LigandPNGBDBM10965((1R,3aS,8aS)-1-hydroxy-1,3a,8-trimethyl-5-[(phenyl...)
Affinity DataIC50: >1.00E+4nM. Assay description: The cholinesterase assays were performed using colorimetric method reported by Ellman. The absorbance changes at 412 nm were recorded for 5 min with ...
In DepthDetails ArticlePubMed
TargetAcetylcholinesterase(Homo sapiens (Human))
National Institutes Of Health
LigandPNGBDBM10965((1R,3aS,8aS)-1-hydroxy-1,3a,8-trimethyl-5-[(phenyl...)
Affinity DataIC50:  200nMpH: 8.0 T: 2°C. Assay description: The cholinesterase assays were performed using colorimetric method reported by Ellman. The absorbance changes at 412 nm were recorded for 5 min with ...
In DepthDetails ArticlePubMed