BDBM10968 (4aS,9aS)-2,4a,9-trimethyl-2H,3H,4H,4aH,9H,9aH-indolo[3,2-e][1,2]oxazin-6-yl N-[4-(propan-2-yl)phenyl]carbamate::4-isopropylphenylgeneserine oxazine
SMILES [H][C@]12ON(C)CC[C@@]1(C)c1cc(OC(=O)Nc3ccc(cc3)C(C)C)ccc1N2C
InChI Key InChIKey=OTFIALPRCHOULO-GMAHTHKFSA-N
Data  2 IC50
  Tab Delimited (TSV)   2D SDfile   Computed 3D by Vconf -m prep SDfile
Find this compound or compounds like it in BindingDB:
Activity Spreadsheet -- Enzyme Inhibition Constant Data from BindingDB
Found 2 hits for monomerid = 10968
TargetCholinesterase(Homo sapiens (Human))
National Institutes Of Health
LigandPNGBDBM10968((4aS,9aS)-2,4a,9-trimethyl-2H,3H,4H,4aH,9H,9aH-ind...)
Affinity DataIC50:  25nM. Assay description: The cholinesterase assays were performed using colorimetric method reported by Ellman. The absorbance changes at 412 nm were recorded for 5 min with ...
In DepthDetails ArticlePubMed
TargetAcetylcholinesterase(Homo sapiens (Human))
National Institutes Of Health
LigandPNGBDBM10968((4aS,9aS)-2,4a,9-trimethyl-2H,3H,4H,4aH,9H,9aH-ind...)
Affinity DataIC50: >1.00E+4nMpH: 8.0 T: 2°C. Assay description: The cholinesterase assays were performed using colorimetric method reported by Ellman. The absorbance changes at 412 nm were recorded for 5 min with ...
In DepthDetails ArticlePubMed