BDBM109689 US8609715, B-46
SMILES NC(=N)c1ccc(OC(=O)c2ccc(CCC(=O)NCP(O)(O)=O)s2)c(F)c1
InChI Key InChIKey=RJKCYNBEQOWJNI-UHFFFAOYSA-N
Data  2 KI
  Tab Delimited (TSV)   2D SDfile   Computed 3D by Vconf -m prep SDfile
Find this compound or compounds like it in BindingDB:
Activity Spreadsheet -- Enzyme Inhibition Constant Data from BindingDB
Found 2 hits for monomerid = 109689
TargetEnteropeptidase(Homo sapiens (Human))
Ajinomoto
US Patent
LigandPNGBDBM109689(US8609715, B-46)
Affinity DataKi:  0.380nM. Assay description: Inhibition assay using human enteropeptidase.
In DepthDetails US Patent
TargetSerine protease 1(Homo sapiens (Human))
Ajinomoto
US Patent
LigandPNGBDBM109689(US8609715, B-46)
Affinity DataKi:  0.440nM. Assay description: Inhibition assay using human trysin.
In DepthDetails US Patent