BDBM109748 CHEMBL179477::US8609708, 22::US8609708, 8
SMILES c1cn(cn1)-c1cccnc1
InChI Key InChIKey=HBSOMQPAIFVKGZ-UHFFFAOYSA-N
Data  1 KI  5 IC50
  Tab Delimited (TSV)   2D SDfile   Computed 3D by Vconf -m prep SDfile
Find this compound or compounds like it in BindingDB:
Activity Spreadsheet -- Enzyme Inhibition Constant Data from BindingDB
Found 6 hits for monomerid = 109748
TargetCytochrome P450 2A6(Homo sapiens (Human))
Human Biomolecular Research Institute
Curated by ChEMBL
LigandPNGBDBM109748(CHEMBL179477 | US8609708, 22 | US8609708, 8)
Affinity DataKi:  620nM. Assay description: Effect on coumarin 7-hydroxylation by human Cytochrome P-450 2A6
In DepthDetails ArticlePubMed
TargetCytochrome P450 2A6(Homo sapiens (Human))
Human Biomolecular Research Institute
Curated by ChEMBL
LigandPNGBDBM109748(CHEMBL179477 | US8609708, 22 | US8609708, 8)
Affinity DataIC50:  3.74E+3nM. Assay description: The inhibition of human CYP2A6-mediated 7-hydroxy coumarin formation was evaluated in the presence of 95 selected test compounds in a standard assay ...
In DepthDetails US Patent
TargetCytochrome P450 3A4(Homo sapiens (Human))
Human Biomolecular Research Institute
US Patent
LigandPNGBDBM109748(CHEMBL179477 | US8609708, 22 | US8609708, 8)
Affinity DataIC50:  1.09E+5nM. Assay description: To gain insight into the selectivity of the synthetic compounds, nicotine, nicotine related alkaloids and nicotine metabolites for inhibition of othe...
In DepthDetails US Patent
TargetCytochrome P450 3A4(Homo sapiens (Human))
Human Biomolecular Research Institute
US Patent
LigandPNGBDBM109748(CHEMBL179477 | US8609708, 22 | US8609708, 8)
Affinity DataIC50:  7.75E+4nM. Assay description: To gain insight into the selectivity of the synthetic compounds, nicotine, nicotine related alkaloids and nicotine metabolites for inhibition of othe...
In DepthDetails US Patent
TargetCytochrome P450 2A6(Homo sapiens (Human))
Human Biomolecular Research Institute
Curated by ChEMBL
LigandPNGBDBM109748(CHEMBL179477 | US8609708, 22 | US8609708, 8)
Affinity DataIC50:  1.02E+3nM. Assay description: The inhibition of human CYP2A6-mediated 7-hydroxy coumarin formation was evaluated in the presence of 95 selected test compounds in a standard assay ...
In DepthDetails US Patent
TargetCytochrome P450 2A6(Homo sapiens (Human))
Human Biomolecular Research Institute
Curated by ChEMBL
LigandPNGBDBM109748(CHEMBL179477 | US8609708, 22 | US8609708, 8)
Affinity DataIC50:  360nM. Assay description: The inhibition of human CYP2A6-mediated 7-hydroxy coumarin formation was evaluated in the presence of 95 selected test compounds in a standard assay ...
In DepthDetails US Patent