BDBM109856 US8609681, 91
SMILES CCCC(F)(F)C[C@H](NC(=O)N1CCC2(CCN(C2)c2ccc(OC)cc2)CC1)C(=O)NC1(CC1)C#N
InChI Key InChIKey=OHDQDHGEJABHEL-QFIPXVFZSA-N
Data  3 KI
  Tab Delimited (TSV)   2D SDfile   Computed 3D by Vconf -m prep SDfile
Find this compound or compounds like it in BindingDB:
Activity Spreadsheet -- Enzyme Inhibition Constant Data from BindingDB
Found 3 hits for monomerid = 109856
TargetCathepsin S(Homo sapiens (Human))
Sanofi
US Patent
LigandPNGBDBM109856(US8609681, 91)
Affinity DataKi:  2nM. Assay description: Determination of the enzymatic activity of the catalytic domain of human Cathepsin S. This protein is obtained as an inactive enzyme from R&D Systems...
Ligand InfoPC cidPC sid
In DepthDetails US Patent
TargetCathepsin K(Homo sapiens (Human))
Sanofi
US Patent
LigandPNGBDBM109856(US8609681, 91)
Affinity DataKi:  43nM. Assay description: Determination of the enzymatic activity of the catalytic domain of human Cathepsin K. This protein is obtained as an inactive enzyme from Sanofi-Aven...
Ligand InfoPC cidPC sid
In DepthDetails US Patent
TargetCathepsin B(Homo sapiens (Human))
Sanofi
US Patent
LigandPNGBDBM109856(US8609681, 91)
Affinity DataKi:  140nM. Assay description: Determination of the enzymatic activity of the catalytic domain of human Cathepsin B. This protein is obtained as an inactive enzyme from Sigma, Wies...
Ligand InfoPC cidPC sid
In DepthDetails US Patent