BDBM109869 US8609647, 7::US8609647, 84
SMILES O=C(CC#N)N1CCCC11CCCN(C1)c1ncnc2[nH]ccc12
InChI Key InChIKey=OTLJPDNWNUSUFF-UHFFFAOYSA-N
Data  6 IC50
  Tab Delimited (TSV)   2D SDfile   Computed 3D by Vconf -m prep SDfile
Find this compound or compounds like it in BindingDB:
Activity Spreadsheet -- Enzyme Inhibition Constant Data from BindingDB
Found 6 hits for monomerid = 109869
TargetTyrosine-protein kinase JAK3(Homo sapiens (Human))
Japan Tobacco
US Patent
LigandPNGBDBM109869(US8609647, 7 | US8609647, 84)
Affinity DataIC50:  5.80nM. Assay description: In the kinase reactions, fused proteins (6His tag-fused hJAK3 kinase domain (aa781-end)) which were coexpressed in Sf21 cells and purified by Ni2+/NT...
In DepthDetails US Patent
TargetTyrosine-protein kinase JAK3(Homo sapiens (Human))
Japan Tobacco
US Patent
LigandPNGBDBM109869(US8609647, 7 | US8609647, 84)
Affinity DataIC50:  14nM. Assay description: In the kinase reactions, fused proteins (6His tag-fused hJAK3 kinase domain (aa781-end)) which were coexpressed in Sf21 cells and purified by Ni2+/NT...
In DepthDetails US Patent
TargetTyrosine-protein kinase Lck(Homo sapiens (Human))
Japan Tobacco
Curated by ChEMBL
LigandPNGBDBM109869(US8609647, 7 | US8609647, 84)
Affinity DataIC50:  6.30E+3nM. Assay description: Inhibition of N-terminal His6-tagged recombinant full-length human Lck using TK-substrate-biotin as substrate incubated for 60 mins in presence of AT...
In DepthDetails ArticlePubMed
TargetTyrosine-protein kinase JAK3(Homo sapiens (Human))
Japan Tobacco
US Patent
LigandPNGBDBM109869(US8609647, 7 | US8609647, 84)
Affinity DataIC50:  36nM. Assay description: Inhibition of human JAK3 (780 to end residues) expressed in baculovirus infected Sf9 cells using TK-substrate-biotin as substrate incubated for 60 mi...
In DepthDetails ArticlePubMed
TargetTyrosine-protein kinase JAK3(Homo sapiens (Human))
Japan Tobacco
US Patent
LigandPNGBDBM109869(US8609647, 7 | US8609647, 84)
Affinity DataIC50:  36nM. Assay description: Inhibition of human JAK3 (780 to end residues) expressed in baculovirus infected Sf9 cells using TK-substrate-biotin as substrate incubated for 60 mi...
In DepthDetails ArticlePubMed
TargetTyrosine-protein kinase JAK2(Homo sapiens (Human))
Japan Tobacco
US Patent
LigandPNGBDBM109869(US8609647, 7 | US8609647, 84)
Affinity DataIC50:  4.70nM. Assay description: In the kinase reactions, fused proteins (6His tag-fused hJAK2 kinase domain (aa808-end)) which were coexpressed in Sf21 cells and purified by Ni2+/NT...
In DepthDetails US Patent