BDBM11008 1-thiocarbamoyl-3,5-diaryl-4,5-dihydro-(1H)-pyrazole deriv. 5::3-(4-fluorophenyl)-5-(4-methylphenyl)-4,5-dihydro-1H-pyrazole-1-carbothioamide
SMILES Cc1ccc(cc1)C1CC(=NN1C(N)=S)c1ccc(F)cc1
InChI Key InChIKey=OAFOIZLJFMIKPR-UHFFFAOYSA-N
Data  2 KI
  Tab Delimited (TSV)   2D SDfile   Computed 3D by Vconf -m prep SDfile
Find this compound or compounds like it in BindingDB:
Activity Spreadsheet -- Enzyme Inhibition Constant Data from BindingDB
Found 2 hits for monomerid = 11008
TargetAmine oxidase [flavin-containing] A(Bos taurus)
Sapienza University Of Rome
LigandPNGBDBM11008(1-thiocarbamoyl-3,5-diaryl-4,5-dihydro-(1H)-pyrazo...)
Affinity DataKi:  7nM ΔG°:  -11.6kcal/molepH: 7.4 T: 2°C. Assay description: MAO A and MAO B activities were determined spectrophotometrically using kynuramine as substrates. Fluorimetric measurements were recorded with a Perk...
In DepthDetails ArticlePubMed
TargetAmine oxidase [flavin-containing] B(Bos taurus)
Sapienza University Of Rome
LigandPNGBDBM11008(1-thiocarbamoyl-3,5-diaryl-4,5-dihydro-(1H)-pyrazo...)
Affinity DataKi:  50nM ΔG°:  -10.4kcal/molepH: 7.4 T: 2°C. Assay description: MAO A and MAO B activities were determined spectrophotometrically using kynuramine as substrates. Fluorimetric measurements were recorded with a Perk...
In DepthDetails ArticlePubMed