BDBM110139 (E)-8-(3-Chlorostyryl)-1,3-dimethyl-7-ethylxanthine (5a)
SMILES CCn1c(\C=C\c2cccc(Cl)c2)nc2n(C)c(=O)n(C)c(=O)c12
InChI Key InChIKey=KVVVWCZIXCAEIX-CMDGGOBGSA-N
Data  1 KI
  Tab Delimited (TSV)   2D SDfile   Computed 3D by Vconf -m prep SDfile
Find this compound or compounds like it in BindingDB:
Activity Spreadsheet -- Enzyme Inhibition Constant Data from BindingDB
Found 1 hit for monomerid = 110139
TargetAdenosine receptor A2a(Rattus norvegicus (rat))
North-West University, Private Bag X6001, Potchefstroom 2520, South Africa
LigandPNGBDBM110139((E)-8-(3-Chlorostyryl)-1,3-dimethyl-7-ethylxanthin...)
Affinity DataKi:  421nM
In DepthDetails ArticlePubMed