BDBM110143 (E)-8-(4-Bromostyryl)-1,3-dimethyl-7-ethylxanthine (5e)
SMILES CCn1c(\C=C\c2ccc(Br)cc2)nc2n(C)c(=O)n(C)c(=O)c12
InChI Key InChIKey=WTGWTELVFKCMKQ-JXMROGBWSA-N
Data  1 KI
  Tab Delimited (TSV)   2D SDfile   Computed 3D by Vconf -m prep SDfile
Find this compound or compounds like it in BindingDB:
Activity Spreadsheet -- Enzyme Inhibition Constant Data from BindingDB
Found 1 hit for monomerid = 110143
TargetAdenosine receptor A2a(Rattus norvegicus (rat))
North-West University, Private Bag X6001, Potchefstroom 2520, South Africa
LigandPNGBDBM110143((E)-8-(4-Bromostyryl)-1,3-dimethyl-7-ethylxanthine...)
Affinity DataKi:  546nM
In DepthDetails ArticlePubMed