BDBM110296 US8613914, 64::US9206232, 64
SMILES CCN(CC)S(=O)(=O)NC(=O)[C@]1(C[C@H]1C=C)NC(=O)[C@@H]1C[C@@]2(CN1C(=O)[C@@H](NC(=O)[C@@H](NC(=O)[C@@H]1CCCCN1C1CCCC1)C1CCCCC1)C(C)(C)C)C(C)(C)C21CCC1
InChI Key InChIKey=DBKVPPPOBUUZEG-ZQGBQPHDSA-N
Data  2 IC50
  Tab Delimited (TSV)   2D SDfile   Computed 3D by Vconf -m prep SDfile
Find this compound or compounds like it in BindingDB:
Activity Spreadsheet -- Enzyme Inhibition Constant Data from BindingDB
Found 2 hits for monomerid = 110296
TargetGenome polyprotein(Hepatitis C virus (HCV genotype 1a, isolate H))
Novartis
US Patent
LigandPNGBDBM110296(US8613914, 64 | US9206232, 64)
Affinity DataIC50:  2nM. Assay description: The inhibitory activity of certain compounds of Table A against HCV NS3-4A serine protease is determined in a homogenous assay using the full-length ...
In DepthDetails US Patent
TargetGenome polyprotein(Hepatitis C virus)
Novartis
US Patent
LigandPNGBDBM110296(US8613914, 64 | US9206232, 64)
Affinity DataIC50:  2nM. Assay description: The inhibitory activity of certain compounds against HCV NS3-4A serine protease is determined in a homogenous assay using the full-length NS3-4A prot...
In DepthDetails US Patent