BDBM110820 US8614206, 371::US8614206, 372
SMILES Cn1ncc(NC(=O)c2nc(sc2N)-c2c(F)cccc2F)c1N1CCC(O)CC(F)(F)C1
InChI Key InChIKey=DGYVAUTULPBPFI-UHFFFAOYSA-N
Data  2 KI
  Tab Delimited (TSV)   2D SDfile   Computed 3D by Vconf -m prep SDfile
Find this compound or compounds like it in BindingDB:
Activity Spreadsheet -- Enzyme Inhibition Constant Data from BindingDB
Found 2 hits for monomerid = 110820
TargetSerine/threonine-protein kinase pim-1(Homo sapiens (Human))
F. Hoffmann-La Roche
US Patent
LigandPNGBDBM110820(US8614206, 371 | US8614206, 372)
Affinity DataKi:  0.00600nMpH: 7.2Assay Description:PIM-1, -2, and -3 enzymes were generated as fusion proteins expressed in bacteria and purified by IMAC column chromatography (Sun, X., Chiu, J. F., a...
In DepthDetails US Patent
TargetSerine/threonine-protein kinase pim-1(Homo sapiens (Human))
F. Hoffmann-La Roche
US Patent
LigandPNGBDBM110820(US8614206, 371 | US8614206, 372)
Affinity DataKi:  0.0150nMpH: 7.2Assay Description:PIM-1, -2, and -3 enzymes were generated as fusion proteins expressed in bacteria and purified by IMAC column chromatography (Sun, X., Chiu, J. F., a...
In DepthDetails US Patent