BDBM111007 US8614253, 3-38::US9241942, 3-38::US9963434, Compound 3-38
SMILES CCOc1ccc(cc1Cl)-c1cc(OC)c(O)c(C=O)c1
InChI Key InChIKey=VJSPSPQWSHRTAQ-UHFFFAOYSA-N
Data  3 IC50
  Tab Delimited (TSV)   2D SDfile   Computed 3D by Vconf -m prep SDfile
Find this compound or compounds like it in BindingDB:
Activity Spreadsheet -- Enzyme Inhibition Constant Data from BindingDB
Found 3 hits for monomerid = 111007
TargetSerine/threonine-protein kinase/endoribonuclease IRE1(Homo sapiens (Human))
Mannkind
US Patent
LigandPNGBDBM111007(US8614253, 3-38 | US9241942, 3-38 | US9963434, Com...)
Affinity DataIC50:  1.10E+3nMpH: 7.5 T: 2°C. Assay description: IRE-1 alpha, T1 RNase, and RNase A assays carried out in vitro with several o-vanillin derivatives to demonstrate selectivity of the derivatives for ...
Ligand InfoPC cidPC sid
In DepthDetails US Patent
TargetSerine/threonine-protein kinase/endoribonuclease IRE1(Homo sapiens (Human))
Mannkind
US Patent
LigandPNGBDBM111007(US8614253, 3-38 | US9241942, 3-38 | US9963434, Com...)
Affinity DataIC50:  1.10E+3nM. Assay description: A fusion protein comprising glutathione S transferase (GST) and human IRE-1α (GST-IRE-1α) was obtained from a 500 ml baculovirus-infected i...
Ligand InfoPC cidPC sid
In DepthDetails US Patent
TargetSerine/threonine-protein kinase/endoribonuclease IRE1(Homo sapiens (Human))
Mannkind
US Patent
LigandPNGBDBM111007(US8614253, 3-38 | US9241942, 3-38 | US9963434, Com...)
Affinity DataIC50:  1.10E+3nMpH: 7.5Assay Description:A fusion protein comprising glutathione S transferase (GST) and human IRE-1α (GST-IRE-1α) was obtained from a 500 ml baculovirus-infected i...
Ligand InfoPC cidPC sid
In DepthDetails US Patent