BDBM111226 US8614253, 26-13::US9241942, 26-13
SMILES Oc1c(C=O)cc(cc1N(=O)=O)-c1cccc2ncccc12
InChI Key InChIKey=LFFOXNMZCQIGTC-UHFFFAOYSA-N
Data  2 IC50  1 EC50
  Tab Delimited (TSV)   2D SDfile   Computed 3D by Vconf -m prep SDfile
Find this compound or compounds like it in BindingDB:
Activity Spreadsheet -- Enzyme Inhibition Constant Data from BindingDB
Found 3 hits for monomerid = 111226
TargetSerine/threonine-protein kinase/endoribonuclease IRE1(Homo sapiens (Human))
Mannkind
US Patent
LigandPNGBDBM111226(US8614253, 26-13 | US9241942, 26-13)
Affinity DataIC50:  3.33E+3nMpH: 7.5 T: 2°C. Assay description: IRE-1 alpha, T1 RNase, and RNase A assays carried out in vitro with several o-vanillin derivatives to demonstrate selectivity of the derivatives for ...
Ligand InfoKEGGPC cidPC sid
In DepthDetails US Patent
TargetSerine/threonine-protein kinase/endoribonuclease IRE1(Homo sapiens (Human))
Mannkind
US Patent
LigandPNGBDBM111226(US8614253, 26-13 | US9241942, 26-13)
Affinity DataEC50:  7.00E+4nM. Assay description: Initial cell-based XBP-1 mRNA splicing assays confirmed IRE-1α inhibition with several potent 5-bromo and 6 bromo o-vanillins. HEK293 cells were...
Ligand InfoKEGGPC cidPC sid
In DepthDetails US Patent
TargetSerine/threonine-protein kinase/endoribonuclease IRE1(Homo sapiens (Human))
Mannkind
US Patent
LigandPNGBDBM111226(US8614253, 26-13 | US9241942, 26-13)
Affinity DataIC50:  333nMpH: 7.5Assay Description:A fusion protein comprising glutathione S transferase (GST) and human IRE-1α (GST-IRE-1α) was obtained from a 500 ml baculovirus-infected i...
Ligand InfoKEGGPC cidPC sid
In DepthDetails US Patent