BDBM111307 US8614253, 43-67::US9241942, 27-67
SMILES OC(=O)c1ccc(cc1)-c1cc(C=O)c(O)c(c1)N(=O)=O
InChI Key InChIKey=FHOCIOYHEVMCAR-UHFFFAOYSA-N
Data  2 IC50  1 EC50
  Tab Delimited (TSV)   2D SDfile   Computed 3D by Vconf -m prep SDfile
Find this compound or compounds like it in BindingDB:
Activity Spreadsheet -- Enzyme Inhibition Constant Data from BindingDB
Found 3 hits for monomerid = 111307
TargetSerine/threonine-protein kinase/endoribonuclease IRE1(Homo sapiens (Human))
Mannkind
US Patent
LigandPNGBDBM111307(US8614253, 43-67 | US9241942, 27-67)
Affinity DataIC50:  101nMpH: 7.5 T: 2°C. Assay description: IRE-1 alpha, T1 RNase, and RNase A assays carried out in vitro with several o-vanillin derivatives to demonstrate selectivity of the derivatives for ...
In DepthDetails US Patent
TargetSerine/threonine-protein kinase/endoribonuclease IRE1(Homo sapiens (Human))
Mannkind
US Patent
LigandPNGBDBM111307(US8614253, 43-67 | US9241942, 27-67)
Affinity DataEC50:  8.00E+4nM. Assay description: Initial cell-based XBP-1 mRNA splicing assays confirmed IRE-1α inhibition with several potent 5-bromo and 6 bromo o-vanillins. HEK293 cells were...
In DepthDetails US Patent
TargetSerine/threonine-protein kinase/endoribonuclease IRE1(Homo sapiens (Human))
Mannkind
US Patent
LigandPNGBDBM111307(US8614253, 43-67 | US9241942, 27-67)
Affinity DataIC50:  101nMpH: 7.5Assay Description:A fusion protein comprising glutathione S transferase (GST) and human IRE-1α (GST-IRE-1α) was obtained from a 500 ml baculovirus-infected i...
In DepthDetails US Patent