BDBM111455 N-(3,5-bis(trifluoromethyl) phenyl)-4-methyl-3-(4-(pyridin-3-yl) pyrimidin-2-ylamino) benzamide (A8)
SMILES Cc1ccc(cc1Nc1nccc(n1)-c1cccnc1)C(=O)Nc1cc(cc(c1)C(F)(F)F)C(F)(F)F
InChI Key InChIKey=ADMAHCJFDCHMKU-UHFFFAOYSA-N
Data  1 IC50
  Tab Delimited (TSV)   2D SDfile   Computed 3D by Vconf -m prep SDfile
Find this compound or compounds like it in BindingDB:
Activity Spreadsheet -- Enzyme Inhibition Constant Data from BindingDB
Found 1 hit for monomerid = 111455
TargetBreakpoint cluster region protein [1-693](Homo sapiens (Human))
Xi'An Jiaotong University
LigandPNGBDBM111455(N-(3,5-bis(trifluoromethyl) phenyl)-4-methyl-3-(4-...)
Affinity DataIC50:  259nM. Assay description: ATP (6.021 μM) and substrate (457.7 nM) were used. Kinase, substrate peptide, and inhibitor were added in a 384-well plate. The reaction was s...
In DepthDetails ArticlePubMed