BDBM111733 US8618111, H-5
SMILES CCc1ncnc(N2CCN(CC2)C(C)C)c1C#Cc1ccc(N)nc1
InChI Key InChIKey=WQOKUICYKHMDQJ-UHFFFAOYSA-N
Data  2 IC50
  Tab Delimited (TSV)   2D SDfile   Computed 3D by Vconf -m prep SDfile
Find this compound or compounds like it in BindingDB:
Activity Spreadsheet -- Enzyme Inhibition Constant Data from BindingDB
Found 2 hits for monomerid = 111733
TargetPhosphatidylinositol 4,5-bisphosphate 3-kinase catalytic subunit alpha isoform(Homo sapiens (Human))
Boehringer Ingelheim International
US Patent
LigandPNGBDBM111733(US8618111, H-5)
Affinity DataIC50:  745nMpH: 7.5 T: 2°C. Assay description: PI3Kalpha assay described herein provides IC50 values indicating the activity of the compounds inhibiting PI3 kinase alpha activity Inhibition of PI3...
In DepthDetails US Patent
TargetSerine/threonine-protein kinase mTOR(Homo sapiens (Human))
Boehringer Ingelheim International
US Patent
LigandPNGBDBM111733(US8618111, H-5)
Affinity DataIC50:  91nMpH: 7.5 T: 2°C. Assay description: The mTOR kinase TR-FRET assay utilizes a physiologically relevant protein substrate for mTOR (4E-BP1, labeled with an acceptor fluorophore (Green Flu...
In DepthDetails US Patent