BDBM112068 US8623889, 66
SMILES CC(C)C(=O)Nc1cc2ccc(cc2cn1)-c1cc(F)ccc1C
InChI Key InChIKey=CWTANYORWHRSCW-UHFFFAOYSA-N
Data  1 KI
  Tab Delimited (TSV)   2D SDfile   Computed 3D by Vconf -m prep SDfile
Find this compound or compounds like it in BindingDB:
Activity Spreadsheet -- Enzyme Inhibition Constant Data from BindingDB
Found 1 hit for monomerid = 112068
TargetTyrosine-protein kinase ABL1(Homo sapiens (Human))
Genentech
US Patent
LigandPNGBDBM112068(US8623889, 66)
Affinity DataKi:  9nM. Assay description: Using the following procedure, varying concentration of compounds of the invention were assessed for their ability to inhibit c-Abl enzyme's phos...
In DepthDetails US Patent