BDBM112090 US8623889, 88
SMILES Cc1ccnc(C)c1-c1ccc2cc(NC(=O)C3CC3)ncc2c1
InChI Key InChIKey=CRBUIRUHADOYMP-UHFFFAOYSA-N
Data  1 KI
  Tab Delimited (TSV)   2D SDfile   Computed 3D by Vconf -m prep SDfile
Find this compound or compounds like it in BindingDB:
Activity Spreadsheet -- Enzyme Inhibition Constant Data from BindingDB
Found 1 hit for monomerid = 112090
TargetTyrosine-protein kinase ABL1(Homo sapiens (Human))
Genentech
US Patent
LigandPNGBDBM112090(US8623889, 88)
Affinity DataKi:  0.300nM. Assay description: Using the following procedure, varying concentration of compounds of the invention were assessed for their ability to inhibit c-Abl enzyme's phos...
In DepthDetails US Patent