BDBM112359 US8623889, 358
SMILES Cc1ccc2[nH]ncc2c1-c1cc2cnc(NC(=O)[C@@H]3C[C@@H]3F)cc2cn1
InChI Key InChIKey=TUMYNXUFFFKFKN-HIFRSBDPSA-N
Data  1 KI
  Tab Delimited (TSV)   2D SDfile   Computed 3D by Vconf -m prep SDfile
Find this compound or compounds like it in BindingDB:
Activity Spreadsheet -- Enzyme Inhibition Constant Data from BindingDB
Found 1 hit for monomerid = 112359
TargetTyrosine-protein kinase ABL1(Homo sapiens (Human))
Genentech
US Patent
LigandPNGBDBM112359(US8623889, 358)
Affinity DataKi:  0.0200nM. Assay description: Using the following procedure, varying concentration of compounds of the invention were assessed for their ability to inhibit c-Abl enzyme's phos...
Ligand InfoPC cidPC sid
In DepthDetails US Patent