BDBM112386 US8623889, 385
SMILES O=C(Nc1cc2ccc(cc2cn1)-c1ccncc1)C1CC1
InChI Key InChIKey=ULAQIRXCYKFERG-UHFFFAOYSA-N
Data  1 KI
  Tab Delimited (TSV)   2D SDfile   Computed 3D by Vconf -m prep SDfile
Find this compound or compounds like it in BindingDB:
Activity Spreadsheet -- Enzyme Inhibition Constant Data from BindingDB
Found 1 hit for monomerid = 112386
TargetTyrosine-protein kinase ABL1(Homo sapiens (Human))
Genentech
US Patent
LigandPNGBDBM112386(US8623889, 385)
Affinity DataKi:  5.65nM. Assay description: Using the following procedure, varying concentration of compounds of the invention were assessed for their ability to inhibit c-Abl enzyme's phos...
In DepthDetails US Patent