BDBM112747 US8629141, 14
SMILES CNC(=O)[C@@H]1NC2(CCNCC2)[C@]2([C@H]1c1cccc(Cl)c1F)C(=O)Nc1cc(Cl)ccc21
InChI Key InChIKey=HVIFZQHAQKSDBI-GEQKSPFYSA-N
Data  2 IC50
  Tab Delimited (TSV)   2D SDfile   Computed 3D by Vconf -m prep SDfile
Find this compound or compounds like it in BindingDB:
Activity Spreadsheet -- Enzyme Inhibition Constant Data from BindingDB
Found 2 hits for monomerid = 112747
TargetE3 ubiquitin-protein ligase Mdm2(Homo sapiens (Human))
University Of Michigan Comprehensive Cancer Center
Curated by ChEMBL
LigandPNGBDBM112747(US8629141, 14)
Affinity DataIC50: >2.00E+3nM. Assay description: Inhibition of [3H]-Ro- 15-1788 binding to recombinant human gamma-aminobutyric-acid A receptor alpha-1-beta-3-gamma-2
In DepthDetails ArticlePubMed
TargetE3 ubiquitin-protein ligase Mdm2(Homo sapiens (Human))
University Of Michigan Comprehensive Cancer Center
Curated by ChEMBL
LigandPNGBDBM112747(US8629141, 14)
Affinity DataIC50: >1.00E+4nM. Assay description: The binding affinity of the MDM2 inhibitors disclosed herein was determined using a fluorescence polarization-based (FP-based) binding assay using a ...
In DepthDetails US Patent