BDBM112949 US8623860, 3.13
SMILES CC(Cc1ccc(cc1)C1CN(C1)c1ccc(OCC2CC2)cc1)NC(=O)Cc1cc[nH]c1
InChI Key InChIKey=GNWDDVFLYOPGTQ-UHFFFAOYSA-N
Data  1 IC50
  Tab Delimited (TSV)   2D SDfile   Computed 3D by Vconf -m prep SDfile
Find this compound or compounds like it in BindingDB:
Activity Spreadsheet -- Enzyme Inhibition Constant Data from BindingDB
Found 1 hit for monomerid = 112949
TargetAcetyl-CoA carboxylase 2(Homo sapiens (Human))
Boehringer Ingelheim International
US Patent
LigandPNGBDBM112949(US8623860, 3.13)
Affinity DataIC50:  2.97E+3nM. Assay description: Malonyl CoA formation by acetyl CoA carboxylases is stoichometrically linked to the consumption of ATP. ACC2 activity is measured in a NADH-linked ki...
In DepthDetails US Patent