BDBM113052 US8633231, 15
SMILES CC1(NC(C(=O)N1CCc1ccc(cc1)C(=O)NCCC(O)=O)c1cccc(c1)C(F)(F)F)C1CCCCC1
InChI Key InChIKey=NKDFNYWJNDERSQ-UHFFFAOYSA-N
Data  1 IC50
  Tab Delimited (TSV)   2D SDfile   Computed 3D by Vconf -m prep SDfile
Find this compound or compounds like it in BindingDB:
Activity Spreadsheet -- Enzyme Inhibition Constant Data from BindingDB
Found 1 hit for monomerid = 113052
TargetGlucagon receptor(Homo sapiens (Human))
Merck Sharp & Dohme
US Patent
LigandPNGBDBM113052(US8633231, 15)
Affinity DataIC50:  3.50E+3nMpH: 7.4 T: 2°C. Assay description: Recombinant human glucagon receptor (huGlucR) membranes and mouse glucagon receptor (mGlucR) membranes were prepared in-house from huGlucR/clone 103c...
Ligand InfoPC cidPC sid
In DepthDetails US Patent