BDBM113356 US10336717, Compound 532::US8633212, 532::US9212153, 532
SMILES CO[C@H]1CC[C@@]2(Cc3ccc(cc3C22N=C(N)N(CC(F)(F)F)C2=O)-c2ncc(C)s2)CC1
InChI Key InChIKey=OUJTWSTUVLKMJE-IPMGMPQXSA-N
Data  3 IC50
  Tab Delimited (TSV)   2D SDfile   Computed 3D by Vconf -m prep SDfile
Find this compound or compounds like it in BindingDB:
Activity Spreadsheet -- Enzyme Inhibition Constant Data from BindingDB
Found 3 hits for monomerid = 113356
TargetIsoform C of Beta-secretase 1 (BACE-I-457)(Homo sapiens (Human))
Vitae Pharmaceuticals
US Patent
LigandPNGBDBM113356(US10336717, Compound 532 | US8633212, 532 | US9212...)
Affinity DataIC50:  320nM. Assay description: For each compound being tested, the BACE activity was monitored in a fluorescence quenching assay (FRET) using the ectodomain of BACE (aa 1-454) fuse...
In DepthDetails US Patent
TargetBeta-secretase 1(Homo sapiens (Human))
Vitae Pharmaceuticals
US Patent
LigandPNGBDBM113356(US10336717, Compound 532 | US8633212, 532 | US9212...)
Affinity DataIC50:  320nM. Assay description: For each compound being tested, the BACE activity was monitored in a fluorescence quenching assay (FRET) using the ectodomain of BACE (aa 1-454) fuse...
In DepthDetails US Patent
TargetBeta-secretase 1 [1-458](Homo sapiens (Human))
Vitae Pharmaceuticals
US Patent
LigandPNGBDBM113356(US10336717, Compound 532 | US8633212, 532 | US9212...)
Affinity DataIC50:  320nMpH: 4.4Assay Description:For each compound being tested, the BACE activity was monitored in a fluorescence quenching assay (FRET) using the ectodomain of BACE (aa 1-454) fuse...
In DepthDetails US Patent