BDBM113419 US8633204, 112
SMILES Cc1nc(N)nc2n(C3CCCC3)c(=O)c(cc12)-c1ccc(Cl)nc1
InChI Key InChIKey=YZDNBLWWOBLXLS-UHFFFAOYSA-N
Data  1 IC50
  Tab Delimited (TSV)   2D SDfile   Computed 3D by Vconf -m prep SDfile
Find this compound or compounds like it in BindingDB:
Activity Spreadsheet -- Enzyme Inhibition Constant Data from BindingDB
Found 1 hit for monomerid = 113419
LigandPNGBDBM113419(US8633204, 112)
Affinity DataIC50:  39.1nMpH: 7.4 T: 2°C. Assay description: Compounds of the present invention were evaluated for potency against PI3-Kα using an in vitro kinase assay. PI3-Kα activity is measured in...
In DepthDetails US Patent