BDBM113710 US8637501, 114
SMILES Cn1c2CCCNCc2c2ccc(nc12)-n1ccc(OCc2ncc(F)cc2F)cc1=O
InChI Key InChIKey=YDCLNMDWUXIIEU-UHFFFAOYSA-N
Data  1 KI
  Tab Delimited (TSV)   2D SDfile   Computed 3D by Vconf -m prep SDfile
Find this compound or compounds like it in BindingDB:
Activity Spreadsheet -- Enzyme Inhibition Constant Data from BindingDB
Found 1 hit for monomerid = 113710
TargetMelanin-concentrating hormone receptor 1(Homo sapiens (Human))
Albany Molecular Research
US Patent
LigandPNGBDBM113710(US8637501, 114)
Affinity DataKi:  44nM ΔG°:  -10.0kcal/molepH: 7.4 T: 2°C. Assay description: Evaluation of the affinity of compounds for the human MCH-1 receptor was accomplished using 4-(3,4,5-tritritiumbenzyloxy)-1-(1-(2-(pyrrolidin-1-yl)et...
In DepthDetails US Patent