BDBM11428 4-({5-[(4-aminocyclohexyl)amino]-3-(propan-2-yl)pyrazolo[1,5-a]pyrimidin-7-yl}amino)-N,N-dimethylbenzene-1-sulfonamide::pyrazolo[1,5-a]pyrimidine 9a
SMILES CC(C)c1cnn2c(Nc3ccc(cc3)S(=O)(=O)N(C)C)cc(N[C@H]3CC[C@H](N)CC3)nc12
InChI Key InChIKey=MDIWBYRNTPTYQI-QAQDUYKDSA-N
Data  2 IC50
PDB links: 1 PDB ID matches this monomer.
  Tab Delimited (TSV)   2D SDfile   Computed 3D by Vconf -m prep SDfile
Find this compound or compounds like it in BindingDB:
Activity Spreadsheet -- Enzyme Inhibition Constant Data from BindingDB
Found 2 hits for monomerid = 11428
TargetGlycogen synthase kinase-3 beta(Rattus norvegicus (rat))
Martin-Luther-University Halle-Wittenberg
LigandPNGBDBM11428(4-({5-[(4-aminocyclohexyl)amino]-3-(propan-2-yl)py...)
Affinity DataIC50:  4.00E+4nMT: 2°C. Assay description: In vitro kinase assay using purified GSK-3 beta was incubated at room temperature with substrate, and test compounds in the presence of 10 uM ATP/ [g...
In DepthDetails ArticlePubMed
TargetCyclin-A2/Cyclin-dependent kinase 2(Homo sapiens (Human))
Vernalis (R&D)
LigandPNGBDBM11428(4-({5-[(4-aminocyclohexyl)amino]-3-(propan-2-yl)py...)
Affinity DataIC50:  59nMpH: 7.5 T: 2°C. Assay description: In vitro kinase assay using purified CDK2/Cyclin A was incubated at room temperature with substrate, and test compounds in the presence of 100 uM ATP...