BDBM114322 3-(2,5,6-trimethylthieno[2,3-d]pyrimidin-4-yl)sulfanyloxolan-2-one::3-[(2,5,6-trimethyl-4-thieno[2,3-d]pyrimidinyl)thio]-2-oxolanone::3-[(2,5,6-trimethylthieno[2,3-d]pyrimidin-4-yl)thio]tetrahydrofuran-2-one::MLS000566711::SMR000153614::cid_4881170
SMILES Cc1sc2nc(C)nc(SC3CCOC3=O)c2c1C
InChI Key InChIKey=DRTFKGMFRMJVSK-UHFFFAOYSA-N
Data  1 IC50
  Tab Delimited (TSV)   2D SDfile   Computed 3D by Vconf -m prep SDfile
Find this compound or compounds like it in BindingDB:
Activity Spreadsheet -- Enzyme Inhibition Constant Data from BindingDB
Found 1 hit for monomerid = 114322
TargetMajor prion protein(Homo sapiens (Human))
The Scripps Research Institute Molecular Screening Center
Curated by PubChem BioAssay
LigandPNGBDBM114322(3-(2,5,6-trimethylthieno[2,3-d]pyrimidin-4-yl)sulf...)
Affinity DataIC50:  1.93E+3nM. Assay description: Source (MLPCN Center Name): The Scripps Research Institute Molecular Screening Center (SRIMSC) Affiliation: The Scripps Research Institute, TSRI Assa...
In DepthDetails PCBioAssay