BDBM41833 Acetic acid N'-[3-oxo-3H-benzo[b]thiophen-(2Z)-ylidene]-N-phenyl-hydrazide::MLS000552761::N-[(3-ketobenzothiophen-2-ylidene)amino]-N-phenyl-acetamide::N-[(3-oxidanylidene-1-benzothiophen-2-ylidene)amino]-N-phenyl-ethanamide::N-[(3-oxo-1-benzothiophen-2-ylidene)amino]-N-phenylacetamide::N-[(Z)-(3-ketobenzothiophen-2-ylidene)amino]-N-phenyl-acetamide::SMR000146276::cid_759934
SMILES CC(=O)N(N=C1Sc2ccccc2C1=O)c1ccccc1
InChI Key InChIKey=KYSFXQOZNRWVLN-UHFFFAOYSA-N
Data  2 IC50  2 EC50
  Tab Delimited (TSV)   2D SDfile   Computed 3D by Vconf -m prep SDfile
Find this compound or compounds like it in BindingDB:
Activity Spreadsheet -- Enzyme Inhibition Constant Data from BindingDB
Found 4 hits for monomerid = 41833
TargetSerine/threonine-protein kinase PLK1(Homo sapiens (Human))
University Of Pittsburgh
Curated by PubChem BioAssay
LigandPNGBDBM41833(Acetic acid N'-[3-oxo-3H-benzo[b]thiophen-(2Z)...)
Affinity DataEC50: >5.00E+4nM. Assay description: List of compounds to be tested: Compounds that met the active criterion of Z-score is
In DepthDetails PCBioAssay
TargetProtein artemis(Homo sapiens (Human))
Burnham Center For Chemical Genomics
Curated by PubChem BioAssay
LigandPNGBDBM41833(Acetic acid N'-[3-oxo-3H-benzo[b]thiophen-(2Z)...)
Affinity DataIC50:  6.46E+3nM. Assay description: Data Source: Sanford-Burnham Center for Chemical Genomics (SBCCG) Source Affiliation: Sanford-Burnham Medical Research Institute (SBMRI, San Diego CA...
In DepthDetails PCBioAssay
TargetSerine/threonine-protein kinase PLK1(Homo sapiens (Human))
University Of Pittsburgh
Curated by PubChem BioAssay
LigandPNGBDBM41833(Acetic acid N'-[3-oxo-3H-benzo[b]thiophen-(2Z)...)
Affinity DataEC50: >5.00E+4nM. Assay description: List of compounds to be tested: Compounds that met the active criterion of Z-score is
In DepthDetails PCBioAssay
TargetSerine/threonine-protein kinase PLK1(Homo sapiens (Human))
University Of Pittsburgh
Curated by PubChem BioAssay
LigandPNGBDBM41833(Acetic acid N'-[3-oxo-3H-benzo[b]thiophen-(2Z)...)
Affinity DataIC50: >5.00E+4nM. Assay description: List of compounds to be tested: Compounds that met the active criterion of Z-score is
In DepthDetails PCBioAssay